Target
Tyrosine-protein kinase BTK
Ligand
BDBM465787
Substrate
Meas. Tech.
In Vitro Assay for the Inhibition of BTK Kinase Activity
IC50
400±n/a nM
Citation
 Li, YHuang, HLiu, GChen, TRen, JSu, Z Compound used as Bruton's tyrosine kinase inhibitor and preparation method and application thereof US Patent  US10793576 Publication Date 10/6/2020 
Target
Name:
Tyrosine-protein kinase BTK
Synonyms:
AGMX1 Agammaglobulinaemia tyrosine kinase B cell progenitor kinase BPK BTK_HUMAN Tyrosine Kinase BTK Tyrosine-protein kinase BTK (BTK)
Type:
Enzyme
Mol. Mass.:
76289.95
Organism:
Homo sapiens (Human)
Description:
Q06187
Residue:
659
  
Inhibitor
Name:
BDBM465787
Synonyms:
US10793576, Example 19
Type:
Small organic molecule
Emp. Form.:
C26H24N8O2
Mol. Mass.:
480.5212
SMILES:
Nc1nccn2c(nc(-c3ccc(cc3)C(=O)Nc3ccccn3)c12)C1NC2C[C@@H]1N(C2)C(=O)C=C
: