Target
Tyrosine-protein kinase BTK
Ligand
BDBM465789
Substrate
Meas. Tech.
In Vitro Assay for the Inhibition of BTK Kinase Activity
IC50
672±n/a nM
Citation
 Li, YHuang, HLiu, GChen, TRen, JSu, Z Compound used as Bruton's tyrosine kinase inhibitor and preparation method and application thereof US Patent  US10793576 Publication Date 10/6/2020 
Target
Name:
Tyrosine-protein kinase BTK
Synonyms:
AGMX1 Agammaglobulinaemia tyrosine kinase B cell progenitor kinase BPK BTK_HUMAN Tyrosine Kinase BTK Tyrosine-protein kinase BTK (BTK)
Type:
Enzyme
Mol. Mass.:
76289.95
Organism:
Homo sapiens (Human)
Description:
Q06187
Residue:
659
  
Inhibitor
Name:
BDBM465789
Synonyms:
US10793576, Example 21
Type:
Small organic molecule
Emp. Form.:
C27H24N8O2
Mol. Mass.:
492.5319
SMILES:
CC#CC(=O)N1CC2C[C@H]1C(N2)c1nc(-c2ccc(cc2)C(=O)Nc2ccccn2)c2c(N)nccn12
: