Target
Tyrosine-protein kinase BTK
Ligand
BDBM465807
Substrate
Meas. Tech.
In Vitro Assay for the Inhibition of BTK Kinase Activity
IC50
68.0±n/a nM
Citation
 Li, YHuang, HLiu, GChen, TRen, JSu, Z Compound used as Bruton's tyrosine kinase inhibitor and preparation method and application thereof US Patent  US10793576 Publication Date 10/6/2020 
Target
Name:
Tyrosine-protein kinase BTK
Synonyms:
AGMX1 Agammaglobulinaemia tyrosine kinase B cell progenitor kinase BPK BTK_HUMAN Tyrosine Kinase BTK Tyrosine-protein kinase BTK (BTK)
Type:
Enzyme
Mol. Mass.:
76289.95
Organism:
Homo sapiens (Human)
Description:
Q06187
Residue:
659
  
Inhibitor
Name:
BDBM465807
Synonyms:
US10793576, Example 39
Type:
Small organic molecule
Emp. Form.:
C28H25N7O3
Mol. Mass.:
507.5432
SMILES:
CC#CC(=O)N1CC2COC[C@@]2(C1)c1nc(-c2ccc(cc2)C(=O)Nc2ccccn2)c2c(N)nccn12
: