Target
Tyrosine-protein kinase BTK
Ligand
BDBM465883
Substrate
Meas. Tech.
In Vitro Assay for the Inhibition of BTK Kinase Activity
IC50
26.0±n/a nM
Citation
 Li, YHuang, HLiu, GChen, TRen, JSu, Z Compound used as Bruton's tyrosine kinase inhibitor and preparation method and application thereof US Patent  US10793576 Publication Date 10/6/2020 
Target
Name:
Tyrosine-protein kinase BTK
Synonyms:
AGMX1 Agammaglobulinaemia tyrosine kinase B cell progenitor kinase BPK BTK_HUMAN Tyrosine Kinase BTK Tyrosine-protein kinase BTK (BTK)
Type:
Enzyme
Mol. Mass.:
76289.95
Organism:
Homo sapiens (Human)
Description:
Q06187
Residue:
659
  
Inhibitor
Name:
BDBM465883
Synonyms:
Preparation of 4-(8-amino-3-((1S)-2-((E)-4-(cyclopropyl(methyl)amino)-2-butenoyl) octahydrocyclopenta[c]pyrrol-1-yl)imidazo[1,5-a]pyrazin-1-yl)-N-(pyridin-2-yl) benzamide | US10793576, Example 115
Type:
Small organic molecule
Emp. Form.:
C33H36N8O2
Mol. Mass.:
576.6913
SMILES:
CN(C\C=C\C(=O)N1CC2CCCC2[C@H]1c1nc(-c2ccc(cc2)C(=O)Nc2ccccn2)c2c(N)nccn12)C1CC1
: