Target
Tyrosine-protein kinase BTK
Ligand
BDBM50175583
Substrate
Meas. Tech.
In Vitro Assay for the Inhibition of BTK Kinase Activity
IC50
47.0±n/a nM
Citation
 Li, YHuang, HLiu, GChen, TRen, JSu, Z Compound used as Bruton's tyrosine kinase inhibitor and preparation method and application thereof US Patent  US10793576 Publication Date 10/6/2020 
Target
Name:
Tyrosine-protein kinase BTK
Synonyms:
AGMX1 Agammaglobulinaemia tyrosine kinase B cell progenitor kinase BPK BTK_HUMAN Tyrosine Kinase BTK Tyrosine-protein kinase BTK (BTK)
Type:
Enzyme
Mol. Mass.:
76289.95
Organism:
Homo sapiens (Human)
Description:
Q06187
Residue:
659
  
Inhibitor
Name:
BDBM50175583
Synonyms:
ACP-196 US10239883, Example 6 US10919899, ACP-196 US11420975, Acalabrutinlb | US9758524, Example 6
Type:
Small organic molecule
Emp. Form.:
C26H23N7O2
Mol. Mass.:
465.5065
SMILES:
[H][C@]1(CCCN1C(=O)C#CC)c1nc(-c2ccc(cc2)C(=O)Nc2ccccn2)c2c(N)nccn12
: