Target
cAMP-specific 3',5'-cyclic phosphodiesterase 4D
Ligand
BDBM466086
Substrate
Meas. Tech.
PDE4 Assay
IC50
<100±n/a nM
Citation
 Liang, XLarsen, J Substituted pyrazoloazepin-8-ones and their use as phosphodiesterase inhibitors US Patent  US10793580 Publication Date 10/6/2020 
Target
Name:
cAMP-specific 3',5'-cyclic phosphodiesterase 4D
Synonyms:
3',5'-cyclic phosphodiesterase PDE43 PDE4D_HUMAN | Phosphodiesterase 4D
Type:
Protein
Mol. Mass.:
91092.69
Organism:
Homo sapiens (Human)
Description:
Q08499
Residue:
809
  
Inhibitor
Name:
BDBM466086
Synonyms:
US10793580, Example 188 | [3-(1-ethyl-8-oxo- spiro[6,7-dihydro-4H- pyrazolo[3,4-c]azepine- 5,4'-tetrahydropyran]-3- yl)-2,2-dimethyl-propyl] 4- methylbenzoate
Type:
Small organic molecule
Emp. Form.:
C26H35N3O4
Mol. Mass.:
453.5738
SMILES:
CCn1nc(CC(C)(C)COC(=O)c2ccc(C)cc2)c2CC3(CCOCC3)CNC(=O)c12
: