Target
Kynurenine/alpha-aminoadipate aminotransferase, mitochondrial
Ligand
BDBM466276
Substrate
Meas. Tech.
Inhibitory Assay
IC50
170±n/a nM
Citation
 Okuyama, MFukunaga, KUsui, KHayashi, NIijima, DHoriuchi, HFujimoto, N Bicyclic heterocyclic compound US Patent  US10793582 Publication Date 10/6/2020 
Target
Name:
Kynurenine/alpha-aminoadipate aminotransferase, mitochondrial
Synonyms:
2-aminoadipate aminotransferase AADAT Alpha-aminoadipate aminotransferase KAT2 Kynurenine aminotransferase II Kynurenine--oxoglutarate aminotransferase II Kynurenine--oxoglutarate transaminase II
Type:
Enzyme
Mol. Mass.:
47353.09
Organism:
Homo sapiens (Human)
Description:
Q8N5Z0
Residue:
425
  
Inhibitor
Name:
BDBM466276
Synonyms:
US10793582, Example 117
Type:
Small organic molecule
Emp. Form.:
C23H26N4O2S
Mol. Mass.:
422.543
SMILES:
COCC1(CC1)c1cnc2nc(sc2c1)N1CCC[C@@H]1C(=O)NCc1ccccc1
: