Target
Kynurenine/alpha-aminoadipate aminotransferase, mitochondrial
Ligand
BDBM466283
Substrate
Meas. Tech.
Inhibitory Assay
IC50
72.0±n/a nM
Citation
 Okuyama, MFukunaga, KUsui, KHayashi, NIijima, DHoriuchi, HFujimoto, N Bicyclic heterocyclic compound US Patent  US10793582 Publication Date 10/6/2020 
Target
Name:
Kynurenine/alpha-aminoadipate aminotransferase, mitochondrial
Synonyms:
2-aminoadipate aminotransferase AADAT Alpha-aminoadipate aminotransferase KAT2 Kynurenine aminotransferase II Kynurenine--oxoglutarate aminotransferase II Kynurenine--oxoglutarate transaminase II
Type:
Enzyme
Mol. Mass.:
47353.09
Organism:
Homo sapiens (Human)
Description:
Q8N5Z0
Residue:
425
  
Inhibitor
Name:
BDBM466283
Synonyms:
US10793582, Example 129
Type:
Small organic molecule
Emp. Form.:
C23H26N4O2S
Mol. Mass.:
422.543
SMILES:
O=C(NCc1ccccc1)[C@H]1CCCN1c1nc2ncc(cc2s1)C1CCOCC1
: