Target
Kynurenine/alpha-aminoadipate aminotransferase, mitochondrial
Ligand
BDBM466300
Substrate
Meas. Tech.
Inhibitory Assay
IC50
640±n/a nM
Citation
 Okuyama, MFukunaga, KUsui, KHayashi, NIijima, DHoriuchi, HFujimoto, N Bicyclic heterocyclic compound US Patent  US10793582 Publication Date 10/6/2020 
Target
Name:
Kynurenine/alpha-aminoadipate aminotransferase, mitochondrial
Synonyms:
2-aminoadipate aminotransferase AADAT Alpha-aminoadipate aminotransferase KAT2 Kynurenine aminotransferase II Kynurenine--oxoglutarate aminotransferase II Kynurenine--oxoglutarate transaminase II
Type:
Enzyme
Mol. Mass.:
47353.09
Organism:
Homo sapiens (Human)
Description:
Q8N5Z0
Residue:
425
  
Inhibitor
Name:
BDBM466300
Synonyms:
(R)—N-benzyl-1-[6-(5-methyl-1,2,4-oxadiazol-3-yl)[1,3]thiazolo[4,5-b]pyridin-2-yl]pyrrolidine-2-carboxamide | US10793582, Example 183
Type:
Small organic molecule
Emp. Form.:
C21H20N6O2S
Mol. Mass.:
420.487
SMILES:
Cc1nc(no1)-c1cnc2nc(sc2c1)N1CCC[C@@H]1C(=O)NCc1ccccc1
: