Target
Probable integral membrane cytochrome D ubiquinol oxidase (Subunit II) CydB (Cytochrome BD-I oxidase subunit II)
Ligand
BDBM466334
Substrate
Meas. Tech.
Mtb cytochrome bd inhibition assay
IC50
250±90 nM
Citation
 Biagini, GAWard, SANixon, GLO''Neill, PM Combination of respiratory electron transport chain inhibitors with a cytochrome bd inhibitor US Patent  US10799494 Publication Date 10/13/2020 
Target
Name:
Probable integral membrane cytochrome D ubiquinol oxidase (Subunit II) CydB (Cytochrome BD-I oxidase subunit II)
Synonyms:
Type:
Protein
Mol. Mass.:
37630.78
Organism:
Description:
O06139
Residue:
346
 
Inhibitor
Name:
BDBM466334
Synonyms:
US10799494, Compound GN-1710
Type:
Small organic molecule
Emp. Form.:
C26H20F3NO4
Mol. Mass.:
467.4365
SMILES:
CCOC(=O)c1c([nH]c2ccccc2c1=O)-c1ccc(Cc2ccc(OC(F)(F)F)cc2)cc1
: