Target
Tyrosine-protein kinase JAK3
Ligand
BDBM466396
Substrate
Meas. Tech.
JAK Kinase Assays
EC50
33.0±n/a nM
Citation
 Larsen, MRitzen, ANørremark, BGreve, DR 5-(7H-pyrrolo[2,3-d]pyrimidin-4-yl)-5-azaspiro[2.5]octane-8-carboxylic acid derivatives as novel JAK kinase inhibitors US Patent  US10799507 Publication Date 10/13/2020 
Target
Name:
Tyrosine-protein kinase JAK3
Synonyms:
JAK-3 JAK3_HUMAN Janus kinase 3 (JAK3) L-JAK | Leukocyte janus kinase
Type:
Protein
Mol. Mass.:
125111.08
Organism:
Homo sapiens (Human)
Description:
P52333
Residue:
1124
  
Inhibitor
Name:
BDBM466396
Synonyms:
(8S)-N-[(1R)-1-(4- cyano-3-methyl- phenyl)-2- hydroxy-ethyl]-5- (7H-pyrrolo[2,3- d]pyrimidin-4-yl)- 5-azaspiro [2.5]octane- 8-carboxamide | US10799507, Example 54
Type:
Small organic molecule
Emp. Form.:
C24H26N6O2
Mol. Mass.:
430.5022
SMILES:
Cc1cc(ccc1C#N)[C@H](CO)NC(=O)[C@H]1CCN(CC11CC1)c1ncnc2[nH]ccc12
: