Target
N-formyl peptide receptor 2
Ligand
BDBM350507
Substrate
Meas. Tech.
FLIPR
EC50
10000±n/a nM
Citation
 Viswanath, VBeard, RLDonello, JEHsia, E Use of agonists of formyl peptide receptor 2 for treating dermatological diseases US Patent  US10799518 Publication Date 10/13/2020 
Target
Name:
N-formyl peptide receptor 2
Synonyms:
ALXR, FPRL1, FPR2 FPR2 FPRH1 Formyl Peptide Receptor-Like 1 LXA4 receptor Lipoxin A4 receptor RFP | hFPRL
Type:
G Protein-Coupled Receptor (GPCR)
Mol. Mass.:
38968.35
Organism:
Homo sapiens (Human)
Description:
P25090
Residue:
351
  
Inhibitor
Name:
BDBM350507
Synonyms:
(2S)-2-({[(3,4- dichlorophenyl)amino]carbonyl}amino)- 3-phenylpropanoic acid US10434112, Table 1.4 | US10799518, Structure TABLE 1.4
Type:
Small organic molecule
Emp. Form.:
C16H14Cl2N2O3
Mol. Mass.:
353.2
SMILES:
OC(=O)C(Cc1ccccc1)NC(=O)Nc1ccc(Cl)c(Cl)c1
: