Target
N-formyl peptide receptor 2
Ligand
BDBM350509
Substrate
Meas. Tech.
FLIPR
EC50
1572±n/a nM
Citation
 Viswanath, VBeard, RLDonello, JEHsia, E Use of agonists of formyl peptide receptor 2 for treating dermatological diseases US Patent  US10799518 Publication Date 10/13/2020 
Target
Name:
N-formyl peptide receptor 2
Synonyms:
ALXR, FPRL1, FPR2 FPR2 FPRH1 Formyl Peptide Receptor-Like 1 LXA4 receptor Lipoxin A4 receptor RFP | hFPRL
Type:
G Protein-Coupled Receptor (GPCR)
Mol. Mass.:
38968.35
Organism:
Homo sapiens (Human)
Description:
P25090
Residue:
351
  
Inhibitor
Name:
BDBM350509
Synonyms:
3-phenyl-2-[({[4- (trifluoromethoxy)phenyl]amino} carbonyl)amino]propanoic acid US10434112, Table 1.6 | US10799518, Structure TABLE 1.6
Type:
Small organic molecule
Emp. Form.:
C17H15F3N2O4
Mol. Mass.:
368.3072
SMILES:
OC(=O)C(Cc1ccccc1)NC(=O)Nc1ccc(OC(F)(F)F)cc1
: