Target
N-formyl peptide receptor 2
Ligand
BDBM350520
Substrate
Meas. Tech.
FLIPR
EC50
49.0±n/a nM
Citation
 Viswanath, VBeard, RLDonello, JEHsia, E Use of agonists of formyl peptide receptor 2 for treating dermatological diseases US Patent  US10799518 Publication Date 10/13/2020 
Target
Name:
N-formyl peptide receptor 2
Synonyms:
ALXR, FPRL1, FPR2 FPR2 FPRH1 Formyl Peptide Receptor-Like 1 LXA4 receptor Lipoxin A4 receptor RFP | hFPRL
Type:
G Protein-Coupled Receptor (GPCR)
Mol. Mass.:
38968.35
Organism:
Homo sapiens (Human)
Description:
P25090
Residue:
351
  
Inhibitor
Name:
BDBM350520
Synonyms:
1-(4-chlorophenyl)-3-(2,4-dioxo- 1,3-diazaspiro[4,5]decan-3-yl) urea US10434112, Table 2.1 | US10799518, Structure TABLE 2.1
Type:
Small organic molecule
Emp. Form.:
C15H17ClN4O3
Mol. Mass.:
336.773
SMILES:
Clc1ccc(NC(=O)NN2C(=O)NC3(CCCCC3)C2=O)cc1
: