Target
N-formyl peptide receptor 2
Ligand
BDBM350522
Substrate
Meas. Tech.
FLIPR
EC50
223±n/a nM
Citation
 Viswanath, VBeard, RLDonello, JEHsia, E Use of agonists of formyl peptide receptor 2 for treating dermatological diseases US Patent  US10799518 Publication Date 10/13/2020 
Target
Name:
N-formyl peptide receptor 2
Synonyms:
ALXR, FPRL1, FPR2 FPR2 FPRH1 Formyl Peptide Receptor-Like 1 LXA4 receptor Lipoxin A4 receptor RFP | hFPRL
Type:
G Protein-Coupled Receptor (GPCR)
Mol. Mass.:
38968.35
Organism:
Homo sapiens (Human)
Description:
P25090
Residue:
351
  
Inhibitor
Name:
BDBM350522
Synonyms:
1-[4-methyl-2,5-dioxo-4-(2- phenylethyl)imidazolidin-1-yl]-3- phenylurea US10434112, Table 2.3 | US10799518, Structure TABLE 2.3
Type:
Small organic molecule
Emp. Form.:
C19H20N4O3
Mol. Mass.:
352.3871
SMILES:
CC1(CCc2ccccc2)NC(=O)N(NC(=O)Nc2ccccc2)C1=O
: