Target
N-formyl peptide receptor 2
Ligand
BDBM350532
Substrate
Meas. Tech.
FLIPR
EC50
679±n/a nM
Citation
 Viswanath, VBeard, RLDonello, JEHsia, E Use of agonists of formyl peptide receptor 2 for treating dermatological diseases US Patent  US10799518 Publication Date 10/13/2020 
Target
Name:
N-formyl peptide receptor 2
Synonyms:
ALXR, FPRL1, FPR2 FPR2 FPRH1 Formyl Peptide Receptor-Like 1 LXA4 receptor Lipoxin A4 receptor RFP | hFPRL
Type:
G Protein-Coupled Receptor (GPCR)
Mol. Mass.:
38968.35
Organism:
Homo sapiens (Human)
Description:
P25090
Residue:
351
  
Inhibitor
Name:
BDBM350532
Synonyms:
N-(4-bromophenyl)-2-(2,4-dioxo-1,3- diazaspiro[4.6]undec-3-yl)acetamide US10799518, Structure TABLE 3.8
Type:
Small organic molecule
Emp. Form.:
C17H20BrN3O3
Mol. Mass.:
394.263
SMILES:
Brc1ccc(NC(=O)CN2C(=O)NC3(CCCCCC3)C2=O)cc1
: