Target
N-formyl peptide receptor 2
Ligand
BDBM350538
Substrate
Meas. Tech.
FLIPR
EC50
395000±n/a nM
Citation
 Viswanath, VBeard, RLDonello, JEHsia, E Use of agonists of formyl peptide receptor 2 for treating dermatological diseases US Patent  US10799518 Publication Date 10/13/2020 
Target
Name:
N-formyl peptide receptor 2
Synonyms:
ALXR, FPRL1, FPR2 FPR2 FPRH1 Formyl Peptide Receptor-Like 1 LXA4 receptor Lipoxin A4 receptor RFP | hFPRL
Type:
G Protein-Coupled Receptor (GPCR)
Mol. Mass.:
38968.35
Organism:
Homo sapiens (Human)
Description:
P25090
Residue:
351
  
Inhibitor
Name:
BDBM350538
Synonyms:
N-(4-bromophenyl)-1,3,3a,4,7,7a- hexahydro-1,3-dioxo-2H-isoindole-2- acetamide US10434112, Table 3.14 | US10799518, Structure TABLE 3.14
Type:
Small organic molecule
Emp. Form.:
C16H15BrN2O3
Mol. Mass.:
363.206
SMILES:
Brc1ccc(NC(=O)CN2C(=O)C3CC=CCC3C2=O)cc1
: