Target
N-formyl peptide receptor 2
Ligand
BDBM350549
Substrate
Meas. Tech.
FLIPR
EC50
1.60±n/a nM
Citation
 Viswanath, VBeard, RLDonello, JEHsia, E Use of agonists of formyl peptide receptor 2 for treating dermatological diseases US Patent  US10799518 Publication Date 10/13/2020 
Target
Name:
N-formyl peptide receptor 2
Synonyms:
ALXR, FPRL1, FPR2 FPR2 FPRH1 Formyl Peptide Receptor-Like 1 LXA4 receptor Lipoxin A4 receptor RFP | hFPRL
Type:
G Protein-Coupled Receptor (GPCR)
Mol. Mass.:
38968.35
Organism:
Homo sapiens (Human)
Description:
P25090
Residue:
351
  
Inhibitor
Name:
BDBM350549
Synonyms:
3-[(4- iodophenyl)carbamoyl] spiro[bicyclo[2.2.1]heptane- 7,1'-cyclopropane]-5-ene-2- carboxylic acid US10434112, Compound 11 | US10799518, Compound 11
Type:
Small organic molecule
Emp. Form.:
C17H16INO3
Mol. Mass.:
409.2183
SMILES:
OC(=O)C1C2C=CC(C1C(=O)Nc1ccc(I)cc1)C21CC1
: