Target
N-formyl peptide receptor 2
Ligand
BDBM350592
Substrate
Meas. Tech.
FLIPR
EC50
5.10±n/a nM
Citation
 Viswanath, VBeard, RLDonello, JEHsia, E Use of agonists of formyl peptide receptor 2 for treating dermatological diseases US Patent  US10799518 Publication Date 10/13/2020 
Target
Name:
N-formyl peptide receptor 2
Synonyms:
ALXR, FPRL1, FPR2 FPR2 FPRH1 Formyl Peptide Receptor-Like 1 LXA4 receptor Lipoxin A4 receptor RFP | hFPRL
Type:
G Protein-Coupled Receptor (GPCR)
Mol. Mass.:
38968.35
Organism:
Homo sapiens (Human)
Description:
P25090
Residue:
351
  
Inhibitor
Name:
BDBM350592
Synonyms:
1-(4-bromophenyl)-3-[4- methyl-2,5-dioxo-4-(2- phenylethyl)imidazolidin-1- yl]urea US10434112, Compound 57 | US10799518, Compound 57
Type:
Small organic molecule
Emp. Form.:
C19H19BrN4O3
Mol. Mass.:
431.283
SMILES:
CC1(CCc2ccccc2)NC(=O)N(NC(=O)Nc2ccc(Br)cc2)C1=O
: