Target
N-formyl peptide receptor 2
Ligand
BDBM350635
Substrate
Meas. Tech.
FLIPR
EC50
3.50±n/a nM
Citation
 Viswanath, VBeard, RLDonello, JEHsia, E Use of agonists of formyl peptide receptor 2 for treating dermatological diseases US Patent  US10799518 Publication Date 10/13/2020 
Target
Name:
N-formyl peptide receptor 2
Synonyms:
ALXR, FPRL1, FPR2 FPR2 FPRH1 Formyl Peptide Receptor-Like 1 LXA4 receptor Lipoxin A4 receptor RFP | hFPRL
Type:
G Protein-Coupled Receptor (GPCR)
Mol. Mass.:
38968.35
Organism:
Homo sapiens (Human)
Description:
P25090
Residue:
351
  
Inhibitor
Name:
BDBM350635
Synonyms:
1-(4-bromophenyl)-3-{4- methyl-4-[2-(5-methylfuran-2- yl)ethyl]-2,5- dioxoimidazolidin-1-yl}urea US10434112, Compound 97 | US10799518, Compound 97
Type:
Small organic molecule
Emp. Form.:
C18H19BrN4O4
Mol. Mass.:
435.272
SMILES:
Cc1ccc(CCC2(C)NC(=O)N(NC(=O)Nc3ccc(Br)cc3)C2=O)o1
: