Target
N-formyl peptide receptor 2
Ligand
BDBM350691
Substrate
Meas. Tech.
FLIPR
EC50
12.0±n/a nM
Citation
 Viswanath, VBeard, RLDonello, JEHsia, E Use of agonists of formyl peptide receptor 2 for treating dermatological diseases US Patent  US10799518 Publication Date 10/13/2020 
Target
Name:
N-formyl peptide receptor 2
Synonyms:
ALXR, FPRL1, FPR2 FPR2 FPRH1 Formyl Peptide Receptor-Like 1 LXA4 receptor Lipoxin A4 receptor RFP | hFPRL
Type:
G Protein-Coupled Receptor (GPCR)
Mol. Mass.:
38968.35
Organism:
Homo sapiens (Human)
Description:
P25090
Residue:
351
  
Inhibitor
Name:
BDBM350691
Synonyms:
US10208071, Compound 154 US10799518, Compound 154 | tert-butyl {[(2S)-2-{[(4- bromophenyl)carbamoyl]amino}- 4-methylpentanoyl](methyl)amino} acetate
Type:
Small organic molecule
Emp. Form.:
C20H30BrN3O4
Mol. Mass.:
456.374
SMILES:
CC(C)C[C@H](NC(=O)Nc1ccc(Br)cc1)C(=O)N(C)CC(=O)OC(C)(C)C
: