Target
Neurotensin receptor type 1
Ligand
BDBM466504
Substrate
Meas. Tech.
Radioligand Binding Assay NTR1
IC50
5.30±n/a nM
Citation
 Osterkamp, FHaase, CReineke, USmerling, CPaschke, MUngewiß, J Conjugate comprising a neurotensin receptor ligand and use thereof US Patent  US10799605 Publication Date 10/13/2020 
Target
Name:
Neurotensin receptor type 1
Synonyms:
Dopamine receptor D2L/neurotensin receptor NTS1 NTRR Neurotensin receptor 1 | neurotensin receptor type 1
Type:
PROTEIN
Mol. Mass.:
46278.89
Organism:
Homo sapiens (Human)
Description:
ChEMBL_1453811
Residue:
418
  
Inhibitor
Name:
BDBM466504
Synonyms:
US10799605, Example 18
Type:
Small organic molecule
Emp. Form.:
C41H56N6O6
Mol. Mass.:
728.9199
SMILES:
COc1cccc(OC)c1-c1cc(nn1-c1ccc(cc1C(C)C)C(=O)N(CCCN)CCCN(C)C)C(=O)NC1(C2CC3CC(C2)CC1C3)C(O)=O
: