Target
DNA-directed RNA polymerase subunit alpha
Ligand
BDBM466507
Substrate
Meas. Tech.
Assay of Inhibition of Escherichia coli RNA Polymerase
IC50
3500±n/a nM
Citation
 Ebright, RHShen, J Arylpropionyl-triketone antibacterial agents US Patent  US10800725 Publication Date 10/13/2020 
Target
Name:
DNA-directed RNA polymerase subunit alpha
Synonyms:
JW3257 RNAP subunit alpha Transcriptase subunit alpha phs sez
Type:
PROTEIN
Mol. Mass.:
36497.18
Organism:
Escherichia coli K-12
Description:
ChEMBL_106172
Residue:
329
  
Inhibitor
Name:
BDBM466507
Synonyms:
US10800725, Compound 15
Type:
Small organic molecule
Emp. Form.:
C30H44O4
Mol. Mass.:
468.668
SMILES:
CC(C)CCC1=C(O)C(CCC(C)C)(CCC(C)C)C(=O)C(C(=O)CCc2ccccc2)=C1O
: