Target
Poly [ADP-ribose] polymerase 1
Ligand
BDBM466544
Substrate
Meas. Tech.
Biochemical Assay
Kd
<30.0±n/a nM
Citation
 Papeo, GMKrasavin, MYOrsini, PScolaro, A 4-carboxamido-isoindolinone derivatives as selective PARP-1 inhibitors US Patent  US10800739 Publication Date 10/13/2020 
Target
Name:
Poly [ADP-ribose] polymerase 1
Synonyms:
(ARTD1 or PARP1) 2.4.2.30 ADPRT ARTD1 Human diphtheria toxin-like ADP-ribosyltransferase (ARTD1 or PARP1) NT-PARP-1 PARP1 PPOL Poly [ADP-ribose] polymerase 1 (PARP) Poly [ADP-ribose] polymerase 1 (PARP1) Poly [ADP-ribose] polymerase 1, 28-kDa form Poly [ADP-ribose] polymerase 1, processed C-terminus Poly [ADP-ribose] polymerase-1 Poly(ADP-ribose) polymerase-1 (ARTD1/PARP1) Protein poly-ADP-ribosyltransferase PARP1 | Synonyms=ADPRT
Type:
Mol. Mass.:
113114.22
Organism:
Homo sapiens (Human)
Description:
P09874
Residue:
1014
  
Inhibitor
Name:
BDBM466544
Synonyms:
US10800739, Compound (23) | US11420940, cpd (23)
Type:
Small organic molecule
Emp. Form.:
C16H20FN3O3
Mol. Mass.:
321.3467
SMILES:
NC(=O)c1cc(F)cc2CN(CCCN3CCOCC3)C(=O)c12
: