Target
Poly [ADP-ribose] polymerase 1
Ligand
BDBM50110836
Substrate
Meas. Tech.
Biochemical Assay
Kd
<30.0±n/a nM
Citation
 Papeo, GMKrasavin, MYOrsini, PScolaro, A 4-carboxamido-isoindolinone derivatives as selective PARP-1 inhibitors US Patent  US10800739 Publication Date 10/13/2020 
Target
Name:
Poly [ADP-ribose] polymerase 1
Synonyms:
(ARTD1 or PARP1) 2.4.2.30 ADPRT ARTD1 Human diphtheria toxin-like ADP-ribosyltransferase (ARTD1 or PARP1) NT-PARP-1 PARP1 PPOL Poly [ADP-ribose] polymerase 1 (PARP) Poly [ADP-ribose] polymerase 1 (PARP1) Poly [ADP-ribose] polymerase 1, 28-kDa form Poly [ADP-ribose] polymerase 1, processed C-terminus Poly [ADP-ribose] polymerase-1 Poly(ADP-ribose) polymerase-1 (ARTD1/PARP1) Protein poly-ADP-ribosyltransferase PARP1 | Synonyms=ADPRT
Type:
Mol. Mass.:
113114.22
Organism:
Homo sapiens (Human)
Description:
P09874
Residue:
1014
  
Inhibitor
Name:
BDBM50110836
Synonyms:
CHEMBL3606017 US11420940, cpd (28)
Type:
Small organic molecule
Emp. Form.:
C19H25N3O3
Mol. Mass.:
343.4201
SMILES:
NC(=O)c1cccc2CN(C3CCN(CC3)C3CCOCC3)C(=O)c12
: