Target
N-formyl peptide receptor 2
Ligand
BDBM391959
Substrate
Meas. Tech.
Biological Data
EC50
175±n/a nM
Citation
 Beard, RLDuong, TTGarst, ME Imidazole derivatives as formyl peptide receptor modulators US Patent  US10800744 Publication Date 10/13/2020 
Target
Name:
N-formyl peptide receptor 2
Synonyms:
ALXR, FPRL1, FPR2 FPR2 FPRH1 Formyl Peptide Receptor-Like 1 LXA4 receptor Lipoxin A4 receptor RFP | hFPRL
Type:
G Protein-Coupled Receptor (GPCR)
Mol. Mass.:
38968.35
Organism:
Homo sapiens (Human)
Description:
P25090
Residue:
351
  
Inhibitor
Name:
BDBM391959
Synonyms:
1-(4-Bromophenyl)-3- (1H-imidazol-2- ylmethyl)urea US10800744, Number 4
Type:
Small organic molecule
Emp. Form.:
C11H11BrN4O
Mol. Mass.:
295.135
SMILES:
Brc1ccc(NC(=O)NCc2ncc[nH]2)cc1
: