Target
N-formyl peptide receptor 2
Ligand
BDBM391967
Substrate
Meas. Tech.
Biological Data
EC50
>2000±n/a nM
Citation
 Beard, RLDuong, TTGarst, ME Imidazole derivatives as formyl peptide receptor modulators US Patent  US10800744 Publication Date 10/13/2020 
Target
Name:
N-formyl peptide receptor 2
Synonyms:
ALXR, FPRL1, FPR2 FPR2 FPRH1 Formyl Peptide Receptor-Like 1 LXA4 receptor Lipoxin A4 receptor RFP | hFPRL
Type:
G Protein-Coupled Receptor (GPCR)
Mol. Mass.:
38968.35
Organism:
Homo sapiens (Human)
Description:
P25090
Residue:
351
  
Inhibitor
Name:
BDBM391967
Synonyms:
Ethyl [2-(1-{[(4- Bromophenyl)carbamoyl] amino}ethyl)-1H- imidazol-1-yl]acetate US10800744, Number 12
Type:
Small organic molecule
Emp. Form.:
C16H19BrN4O3
Mol. Mass.:
395.251
SMILES:
CCOC(=O)Cn1ccnc1C(C)NC(=O)Nc1ccc(Br)cc1
: