Target
Vasopressin V2 receptor
Ligand
BDBM466529
Substrate
Meas. Tech.
Cellular In Vitro Assay for Determining Vasopressin V2 Receptor Activity
IC50
4.90±n/a nM
Citation
 Schmeck, CEngelen, AKolkhof, PLustig, KPook, EWasnaire, P Oxoalkyl-substituted phenyltriazole derivatives and uses thereof US Patent  US10800746 Publication Date 10/13/2020 
Target
Name:
Vasopressin V2 receptor
Synonyms:
ADHR AVPR2 DIR Renal-type arginine vasopressin receptor V2R_HUMAN Vasopressin V2 receptor | Vasopressin receptor
Type:
Receptor
Mol. Mass.:
40295.28
Organism:
Homo sapiens (Human)
Description:
P30518
Residue:
371
  
Inhibitor
Name:
BDBM466529
Synonyms:
2-{[5-Acetyl-1-(2-chlorophenyl)-1H-1,2,4-triazol-3-yl]methyl}-5-(4-chlorophenyl)-4-[(2S)-3,3,3-trifluoro-2-hydroxypropyl]-2,4-dihydro-3H-1,2,4-triazol-3-one | US10800746, Example 3
Type:
Small organic molecule
Emp. Form.:
C22H17Cl2F3N6O3
Mol. Mass.:
541.31
SMILES:
CC(=O)c1nc(Cn2nc(-c3ccc(Cl)cc3)n(C[C@H](O)C(F)(F)F)c2=O)nn1-c1ccccc1Cl
: