Target
Vasopressin V1a receptor
Ligand
BDBM192453
Substrate
Meas. Tech.
Cellular In Vitro Assay for Determining Vasopressin V1a Receptor Activity
IC50
16.6±n/a nM
Citation
 Schmeck, CEngelen, AKolkhof, PLustig, KPook, EWasnaire, P Oxoalkyl-substituted phenyltriazole derivatives and uses thereof US Patent  US10800746 Publication Date 10/13/2020 
Target
Name:
Vasopressin V1a receptor
Synonyms:
AVPR V1a AVPR1A V1AR_HUMAN VASOPRESSIN V1A Vasopressin V1 receptor Vasopressin receptor
Type:
Receptor
Mol. Mass.:
46820.18
Organism:
Homo sapiens (Human)
Description:
P37288
Residue:
418
  
Inhibitor
Name:
BDBM192453
Synonyms:
US10800746, Example WO 2011/104322 54 US9687476, 54
Type:
Small organic molecule
Emp. Form.:
C20H15Cl2F3N6O2
Mol. Mass.:
499.273
SMILES:
O[C@@H](Cn1c(nn(Cc2nnc([nH]2)-c2ccccc2Cl)c1=O)-c1ccc(Cl)cc1)C(F)(F)F
: