Target
4-aminobutyrate aminotransferase, mitochondrial
Ligand
BDBM323800
Substrate
Meas. Tech.
Evaluation of Compounds as Inhibitors of GABA-AT
Ki
2230000±n/a nM
Citation
 Silverman, RBLe, HVHawker, DD Tetrahydrothiophene-based GABA aminotransferase inactivators and analogs thereof for treating neurological disorders US Patent  US10800753 Publication Date 10/13/2020 
Target
Name:
4-aminobutyrate aminotransferase, mitochondrial
Synonyms:
(S)-3-amino-2-methylpropionate transaminase ABAT GABA transaminase GABA-T GABT_HUMAN L-AIBAT
Type:
PROTEIN
Mol. Mass.:
56449.39
Organism:
Homo sapiens (Human)
Description:
ChEMBL_1459248
Residue:
500
  
Inhibitor
Name:
BDBM323800
Synonyms:
(2R,4S)-4-Aminotetrahydrothiophene-2-carboxylic acid US10800753, Compound 18
Type:
Small organic molecule
Emp. Form.:
C5H9NO2S
Mol. Mass.:
147.195
SMILES:
N[C@@H]1CS[C@H](C1)C(O)=O
: