Target
5-hydroxytryptamine receptor 1A
Ligand
BDBM466576
Substrate
Meas. Tech.
Evaluation of Binding Activity to Human 5-HT1A Receptor, Human D4 Receptor, and Human D2 Receptor
IC50
1.40±n/a nM
Citation
 Yoshinaga, HUemachi, HOhno, TBesnard, J 2,6-disubstituted pyridine derivative US Patent  US10800755 Publication Date 10/13/2020 
Target
Name:
5-hydroxytryptamine receptor 1A
Synonyms:
5-HT-1A 5-hydroxytryptamine receptor 1A (5-HT-1A) ADRB2RL1 Dopamine D2 receptor and serotonin 1a receptor HTR1A | Serotonin receptor 1A
Type:
Mol. Mass.:
46122.49
Organism:
Homo sapiens (Human)
Description:
Residue:
422
  
Inhibitor
Name:
BDBM466576
Synonyms:
2,2-Dimethyl-N-[2-(6-methyl-3′,6′-dihydro[2,4′-bipyridin]-1′ (2′H)-yl)ethyl]propanamide US11014905, Example 30
Type:
Small organic molecule
Emp. Form.:
C18H27N3O
Mol. Mass.:
301.4265
SMILES:
Cc1cccc(n1)C1=CCN(CCNC(=O)C(C)(C)C)CC1
: