Target
D(4) dopamine receptor
Ligand
BDBM466583
Substrate
Meas. Tech.
Evaluation of Binding Activity to Human 5-HT1A Receptor, Human D4 Receptor, and Human D2 Receptor
IC50
73.0±n/a nM
Citation
 Yoshinaga, HUemachi, HOhno, TBesnard, J 2,6-disubstituted pyridine derivative US Patent  US10800755 Publication Date 10/13/2020 
Target
Name:
D(4) dopamine receptor
Synonyms:
D(2C) dopamine receptor DOPAMINE D4.2 DRD4 Dopamine D4 receptor
Type:
Enzyme
Mol. Mass.:
48373.19
Organism:
Homo sapiens (Human)
Description:
P21917
Residue:
419
  
Inhibitor
Name:
BDBM466583
Synonyms:
N-(2-{4-[6-(Methylamino)pyridin-2-yl]piperidin-1-yl}ethyl)-tetrahydro-2H-pyran-4-carboxamide US11014905, Example 37
Type:
Small organic molecule
Emp. Form.:
C19H30N4O2
Mol. Mass.:
346.4671
SMILES:
CNc1cccc(n1)C1CCN(CCNC(=O)C2CCOCC2)CC1
: