Target
Short transient receptor potential channel 6
Ligand
BDBM466629
Substrate
Meas. Tech.
High Throughput Screening Assay
IC50
150±n/a nM
Citation
 Bouyssou, TGottschling, DHeine, NKeenan, LLLowe, MDRazavi, HSarko, CRSurprenant, STakahashi, HTurner, MRWu, X Inhibitors of TRPC6 US Patent  US10800757 Publication Date 10/13/2020 
Target
Name:
Short transient receptor potential channel 6
Synonyms:
TRP-6 TRPC6 Transient receptor protein 6
Type:
PROTEIN
Mol. Mass.:
106326.67
Organism:
Homo sapiens (Human)
Description:
ChEMBL_107640
Residue:
931
  
Inhibitor
Name:
BDBM466629
Synonyms:
(6-Amino-4-methoxy-3',4',5',6'- tetrahydro-2'H-[3,4']bipyridinyl-1'-yl)- [5-(3,3-difluoro-cyclobutylmethoxy)-4- methoxy-pyridin-2-yl]-methanone US10889568, Compound 45
Type:
Small organic molecule
Emp. Form.:
C23H28F2N4O4
Mol. Mass.:
462.4896
SMILES:
COc1cc(ncc1OCC1CC(F)(F)C1)C(=O)N1CCC(CC1)c1cnc(N)cc1OC
: