Target
Short transient receptor potential channel 6
Ligand
BDBM466634
Substrate
Meas. Tech.
High Throughput Screening Assay
IC50
47.0±n/a nM
Citation
 Bouyssou, TGottschling, DHeine, NKeenan, LLLowe, MDRazavi, HSarko, CRSurprenant, STakahashi, HTurner, MRWu, X Inhibitors of TRPC6 US Patent  US10800757 Publication Date 10/13/2020 
Target
Name:
Short transient receptor potential channel 6
Synonyms:
TRP-6 TRPC6 Transient receptor protein 6
Type:
PROTEIN
Mol. Mass.:
106326.67
Organism:
Homo sapiens (Human)
Description:
ChEMBL_107640
Residue:
931
  
Inhibitor
Name:
BDBM466634
Synonyms:
(1R)-1-[(2R)-4-(6-amino-4- methoxypyridin-3-yl)-1-(5- phenoxypyridine-2- carbonyl)piperazin-2-yl]ethan-1-ol US10889568, Compound 50
Type:
Small organic molecule
Emp. Form.:
C24H27N5O4
Mol. Mass.:
449.5023
SMILES:
COc1cc(N)ncc1N1CCN([C@H](C1)[C@@H](C)O)C(=O)c1ccc(Oc2ccccc2)cn1
: