Target
Short transient receptor potential channel 6
Ligand
BDBM466677
Substrate
Meas. Tech.
High Throughput Screening Assay
IC50
635±n/a nM
Citation
 Bouyssou, TGottschling, DHeine, NKeenan, LLLowe, MDRazavi, HSarko, CRSurprenant, STakahashi, HTurner, MRWu, X Inhibitors of TRPC6 US Patent  US10800757 Publication Date 10/13/2020 
Target
Name:
Short transient receptor potential channel 6
Synonyms:
TRP-6 TRPC6 Transient receptor protein 6
Type:
PROTEIN
Mol. Mass.:
106326.67
Organism:
Homo sapiens (Human)
Description:
ChEMBL_107640
Residue:
931
  
Inhibitor
Name:
BDBM466677
Synonyms:
4-Methoxy-5-[1-(4-methoxy-5-{[trans- 3-(trifluoromethyl)cyclobutyl]- methoxy}pyridine-2-carbonyl)- piperidin-4-yl]pyridin-2-amine US10889568, Compound 92
Type:
Small organic molecule
Emp. Form.:
C24H29F3N4O4
Mol. Mass.:
494.5067
SMILES:
COc1cc(ncc1OC[C@H]1C[C@@H](C1)C(F)(F)F)C(=O)N1CCC(CC1)c1cnc(N)cc1OC
: