Target
Mitogen-activated protein kinase kinase kinase kinase 1
Ligand
BDBM466697
Substrate
Meas. Tech.
HPK1 Kinase Binding Assay
Ki
<100±n/a nM
Citation
 Vechorkin, OPan, JSokolsky, AStyduhar, EYao, W Carboxamide compounds and uses thereof US Patent  US10800761 Publication Date 10/13/2020 
Target
Name:
Mitogen-activated protein kinase kinase kinase kinase 1
Synonyms:
HPK1 MAP4K1
Type:
PROTEIN
Mol. Mass.:
91316.07
Organism:
Homo sapiens (Human)
Description:
ChEMBL_586597
Residue:
833
  
Inhibitor
Name:
BDBM466697
Synonyms:
US10800761, Example 16 | US11731958, Example 16
Type:
Small organic molecule
Emp. Form.:
C27H25F2N7O2
Mol. Mass.:
517.5299
SMILES:
COc1cccc(F)c1-c1nccc(n1)C(=O)Nc1cc(F)cc(-c2cnn(C)c2)c1N1C[C@H]2C[C@@H]1CN2
: