Target
Mitogen-activated protein kinase kinase kinase kinase 1
Ligand
BDBM466714
Substrate
Meas. Tech.
HPK1 Kinase Binding Assay
Ki
<100±n/a nM
Citation
 Vechorkin, OPan, JSokolsky, AStyduhar, EYao, W Carboxamide compounds and uses thereof US Patent  US10800761 Publication Date 10/13/2020 
Target
Name:
Mitogen-activated protein kinase kinase kinase kinase 1
Synonyms:
HPK1 MAP4K1
Type:
PROTEIN
Mol. Mass.:
91316.07
Organism:
Homo sapiens (Human)
Description:
ChEMBL_586597
Residue:
833
  
Inhibitor
Name:
BDBM466714
Synonyms:
US10800761, Example 33 | US11731958, Example 33
Type:
Small organic molecule
Emp. Form.:
C25H25F2N5O3
Mol. Mass.:
481.4945
SMILES:
COc1cccc(F)c1-c1nccc(n1)C(=O)Nc1cc(F)ccc1N1C[C@H]2C[C@@H]1CN2CCO
: