Target
Mitogen-activated protein kinase kinase kinase kinase 1
Ligand
BDBM466716
Substrate
Meas. Tech.
HPK1 Kinase Binding Assay
Ki
<100±n/a nM
Citation
 Vechorkin, OPan, JSokolsky, AStyduhar, EYao, W Carboxamide compounds and uses thereof US Patent  US10800761 Publication Date 10/13/2020 
Target
Name:
Mitogen-activated protein kinase kinase kinase kinase 1
Synonyms:
HPK1 MAP4K1
Type:
PROTEIN
Mol. Mass.:
91316.07
Organism:
Homo sapiens (Human)
Description:
ChEMBL_586597
Residue:
833
  
Inhibitor
Name:
BDBM466716
Synonyms:
US10800761, Example 35 | US11731958, Example 35
Type:
Small organic molecule
Emp. Form.:
C24H24FN5O3
Mol. Mass.:
449.4775
SMILES:
COc1ccc(N2C[C@H]3C[C@@H]2CN3)c(NC(=O)c2ccnc(n2)-c2c(F)cccc2OC)c1
: