Target
Mitogen-activated protein kinase kinase kinase kinase 1
Ligand
BDBM466737
Substrate
Meas. Tech.
HPK1 Kinase Binding Assay
Ki
<100±n/a nM
Citation
 Vechorkin, OPan, JSokolsky, AStyduhar, EYao, W Carboxamide compounds and uses thereof US Patent  US10800761 Publication Date 10/13/2020 
Target
Name:
Mitogen-activated protein kinase kinase kinase kinase 1
Synonyms:
HPK1 MAP4K1
Type:
PROTEIN
Mol. Mass.:
91316.07
Organism:
Homo sapiens (Human)
Description:
ChEMBL_586597
Residue:
833
  
Inhibitor
Name:
BDBM466737
Synonyms:
US10800761, Example 56 | US11731958, Example 56
Type:
Small organic molecule
Emp. Form.:
C30H26FN7O3
Mol. Mass.:
551.5709
SMILES:
COc1cccc(F)c1-c1nccc(n1)C(=O)Nc1ccc(cc1N1[C@@H]2CN[C@@H](C2)[C@@H]1CO)-c1cnccc1C#N
: