Target
Mitogen-activated protein kinase kinase kinase kinase 1
Ligand
BDBM466747
Substrate
Meas. Tech.
HPK1 Kinase Binding Assay
Ki
<100±n/a nM
Citation
 Vechorkin, OPan, JSokolsky, AStyduhar, EYao, W Carboxamide compounds and uses thereof US Patent  US10800761 Publication Date 10/13/2020 
Target
Name:
Mitogen-activated protein kinase kinase kinase kinase 1
Synonyms:
HPK1 MAP4K1
Type:
PROTEIN
Mol. Mass.:
91316.07
Organism:
Homo sapiens (Human)
Description:
ChEMBL_586597
Residue:
833
  
Inhibitor
Name:
BDBM466747
Synonyms:
US10800761, Example 66 | US11731958, Example 66
Type:
Small organic molecule
Emp. Form.:
C22H20F3N5O2
Mol. Mass.:
443.4217
SMILES:
N[C@H]1C[C@@H](CO)N(C1)c1ccc(F)cc1NC(=O)c1ccnc(n1)-c1c(F)cccc1F
: