Target
Receptor protein-tyrosine kinase
Ligand
BDBM276744
Substrate
Meas. Tech.
Human, Dog and Rat c-Fms Enzyme Assay
IC50
2.00±n/a nM
Citation
 Chen, JDonahue, MLim, HLin, RSalter, RWu, JGong, Y Substituted pyridine derivatives useful as C-FMS kinase inhibitors US Patent  US10800764 Publication Date 10/13/2020 
Target
Name:
Receptor protein-tyrosine kinase
Synonyms:
Type:
Protein
Mol. Mass.:
151541.18
Organism:
Dog
Description:
Q2XPT7
Residue:
1355
  
Inhibitor
Name:
BDBM276744
Synonyms:
US10071991, Compound (I-M2-2S,4R) US11214566, Compound (I-M2-2S,4R)
Type:
Small organic molecule
Emp. Form.:
C27H33N5O4
Mol. Mass.:
491.582
SMILES:
CC1(C)CCC(=CC1)c1nc(ccc1NC(=O)c1nc(c[nH]1)C#N)[C@@H]1CC(C)(C)O[C@@](C)(C1)C(O)=O
: