Target
Prostaglandin D2 receptor 2
Ligand
BDBM466826
Substrate
Meas. Tech.
Biological Activity Assay
IC50
550±n/a nM
Citation
 Yao, YChen, BChen, YLi, AXu, RHuang, ZTian, DLi, HYang, CLi, JChen, S Indole derivative used as CRTH2 inhibitor US Patent  US10800765 Publication Date 10/13/2020 
Target
Name:
Prostaglandin D2 receptor 2
Synonyms:
CD_antigen=CD294 Chemoattractant Receptor-homologous molecule expressed on T-helper type 2 cells (CRTH2) Chemoattractant receptor-homologous molecule expressed on Th2 cells (CRTH2) G protein-coupled receptor 44 GPR44 PTGDR2 Prostaglandin D2 receptor 2 | Prostaglandin D2 receptor 2 (PGD2)
Type:
Enzyme
Mol. Mass.:
43295.45
Organism:
Homo sapiens (Human)
Description:
Q9Y5Y4
Residue:
395
  
Inhibitor
Name:
BDBM466826
Synonyms:
US10800765, Example 50
Type:
Small organic molecule
Emp. Form.:
C20H19NO4S
Mol. Mass.:
369.434
SMILES:
Cc1c(Cc2ccc3c(CCS3(=O)=O)c2)c2ccccc2n1CC(O)=O
: