Target
Prostaglandin D2 receptor 2
Ligand
BDBM466845
Substrate
Meas. Tech.
Biological Activity Assay
IC50
<100±n/a nM
Citation
 Yao, YChen, BChen, YLi, AXu, RHuang, ZTian, DLi, HYang, CLi, JChen, S Indole derivative used as CRTH2 inhibitor US Patent  US10800765 Publication Date 10/13/2020 
Target
Name:
Prostaglandin D2 receptor 2
Synonyms:
CD_antigen=CD294 Chemoattractant Receptor-homologous molecule expressed on T-helper type 2 cells (CRTH2) Chemoattractant receptor-homologous molecule expressed on Th2 cells (CRTH2) G protein-coupled receptor 44 GPR44 PTGDR2 Prostaglandin D2 receptor 2 | Prostaglandin D2 receptor 2 (PGD2)
Type:
Enzyme
Mol. Mass.:
43295.45
Organism:
Homo sapiens (Human)
Description:
Q9Y5Y4
Residue:
395
  
Inhibitor
Name:
BDBM466845
Synonyms:
US10800765, Example 69
Type:
Small organic molecule
Emp. Form.:
C20H18FN3O4S
Mol. Mass.:
415.438
SMILES:
Cc1c(Cc2ccc3c(c2)N=C(C)NS3(=O)=O)c2cc(F)ccc2n1CC(O)=O
: