Target
Prostaglandin D2 receptor 2
Ligand
BDBM466846
Substrate
Meas. Tech.
Biological Activity Assay
IC50
<100±n/a nM
Citation
 Yao, YChen, BChen, YLi, AXu, RHuang, ZTian, DLi, HYang, CLi, JChen, S Indole derivative used as CRTH2 inhibitor US Patent  US10800765 Publication Date 10/13/2020 
Target
Name:
Prostaglandin D2 receptor 2
Synonyms:
CD_antigen=CD294 Chemoattractant Receptor-homologous molecule expressed on T-helper type 2 cells (CRTH2) Chemoattractant receptor-homologous molecule expressed on Th2 cells (CRTH2) G protein-coupled receptor 44 GPR44 PTGDR2 Prostaglandin D2 receptor 2 | Prostaglandin D2 receptor 2 (PGD2)
Type:
Enzyme
Mol. Mass.:
43295.45
Organism:
Homo sapiens (Human)
Description:
Q9Y5Y4
Residue:
395
  
Inhibitor
Name:
BDBM466846
Synonyms:
US10800765, Example 70
Type:
Small organic molecule
Emp. Form.:
C23H24FN3O4S
Mol. Mass.:
457.518
SMILES:
CN1CN(C2CC2)S(=O)(=O)c2ccc(Cc3c(C)n(CC(O)=O)c4ccc(F)cc34)cc12
: