Target
Thyroid hormone receptor alpha
Ligand
BDBM466886
Substrate
Meas. Tech.
Time-Resolved Fluorescence Resonance Energy Transfer (TR-FRET) Assay for Thyroid Hormone Receptor Agonist Screening
EC50
>5000±n/a nM
Citation
 Kirschberg, TAHalcomb, RXu, YRomero, FA Thyroid hormone receptor beta agonist compounds US Patent  US10800767 Publication Date 10/13/2020 
Target
Name:
Thyroid hormone receptor alpha
Synonyms:
C-erbA-alpha EAR7 NR1A1 THA_HUMAN THRA1 Thyroid Hormone Receptor (TR-alpha) Thyroid hormone receptor alpha c-erbA-1
Type:
Receptor
Mol. Mass.:
54818.00
Organism:
Homo sapiens (Human)
Description:
Recombinant hThR was obtained from nuclear extracts from SF9 cells infected with baculovirus vectors encoding for ThRalpha 1.
Residue:
490
  
Inhibitor
Name:
BDBM466886
Synonyms:
US10800767, Example 29P1
Type:
Small organic molecule
Emp. Form.:
C15H11Cl2N5O6
Mol. Mass.:
428.184
SMILES:
C[C@@H](O)c1cc(Oc2c(Cl)cc(NC(=O)c3noc(=O)[nH]3)cc2Cl)n[nH]c1=O
: