Target
Programmed cell death 1 ligand 1 [19-238]/protein 1 [25-167]
Ligand
BDBM395480
Substrate
Meas. Tech.
TBD
IC50
3000±n/a nM
Citation
 Wu, LLi, JYao, WQi, CQian, DZhang, F Heterocyclic compounds as immunomodulators US Patent  US10800768 Publication Date 10/13/2020 
Target
Name:
Programmed cell death 1 ligand 1 [19-238]/protein 1 [25-167]
Synonyms:
PD-1/PD-L1
Type:
Protein
Mol. Mass.:
Description:
Components:
This complex has 2 components.
Component 1
Name:
Programmed cell death protein 1 [25-167]
Synonyms:
PD1 PDCD1_HUMAN Programmed cell death protein 1 (aa25-167) hPD-1
Type:
Enzyme Catalytic Domain
Mol. Mass.:
15954.64
Organism:
Homo sapiens (Human)
Description:
Q15116 (aa25-167)
Residue:
143
  
Component 2
Name:
Programmed cell death 1 ligand 1 [19-238]
Synonyms:
B7H1 PD-L1 PDCD1 ligand 1 PDCD1LG1 Programmed cell death 1 ligand 1 (aa19-238) hPD-L1
Type:
Enzyme Catalytic Domain
Mol. Mass.:
25191.31
Organism:
Homo sapiens (Human)
Description:
Q9NZQ7 (aa19-238)
Residue:
220
  
Inhibitor
Name:
BDBM395480
Synonyms:
(S)-1-((2-(2′-chloro-2-methyl-3′-(1-methyl-4,5,6,7-tetrahydro-1H-imidazo[4,5-c]pyridine-2-carboxamido)biphenyl-3-yl)-7-cyanobenzo[d]oxazol-5-yl)methyl)pyrrolidine-3-carboxylic acid US10800768, Example 92 | US11339149, Example 92
Type:
Small organic molecule
Emp. Form.:
C35H32ClN7O4
Mol. Mass.:
650.126
SMILES:
Cc1c(cccc1-c1cccc(NC(=O)c2nc3CNCCc3n2C)c1Cl)-c1nc2cc(CN3CC[C@@H](C3)C(O)=O)cc(C#N)c2o1
: