Target
ATR-interacting protein/Serine/threonine-protein kinase ATR
Ligand
BDBM411431
Substrate
Meas. Tech.
ATR/ATRIP Enzymatic Assay
IC50
8.00±n/a nM
Citation
 Di Francesco, MEJones, PCarroll, CLCross, JBRamaswamy, SKJohnson, MGLively, SLapointe, D Heterocyclic inhibitors of ATR kinase US Patent  US10800769 Publication Date 10/13/2020 
Target
Name:
ATR-interacting protein/Serine/threonine-protein kinase ATR
Synonyms:
ATR/ATRIP
Type:
Enzyme
Mol. Mass.:
Description:
Components:
This complex has 2 components.
Component 1
Name:
Serine/threonine-protein kinase ATR
Synonyms:
ATR Ataxia telangiectasia and Rad3-related protein (ATR) FRP1 | Serine-protein kinase ATR
Type:
Protein
Mol. Mass.:
301404.58
Organism:
Homo sapiens (Human)
Description:
Q13535
Residue:
2644
  
Component 2
Name:
ATR-interacting protein
Synonyms:
AGS1 ATR-interacting protein (ATRIP) ATRIP_HUMAN
Type:
Enzyme Catalytic Domain
Mol. Mass.:
85833.30
Organism:
Homo sapiens (Human)
Description:
Q8WXE1
Residue:
791
  
Inhibitor
Name:
BDBM411431
Synonyms:
1-({6-[(3R)-3-methyl- morpholin-4-yl]-2-{1H- pyrrolo[2,3-b]pyridin-4- yl}pyrimidin-4-yl}- imino)-1lambda6-thian-1-one US10800769, Example 4 | US11434233, Example 4
Type:
Small organic molecule
Emp. Form.:
C21H26N6O2S
Mol. Mass.:
426.535
SMILES:
C[C@@H]1COCCN1c1cc(N=S2(=O)CCCCC2)nc(n1)-c1ccnc2[nH]ccc12
: