Target
ATR-interacting protein/Serine/threonine-protein kinase ATR
Ligand
BDBM411445
Substrate
Meas. Tech.
ATR/ATRIP Enzymatic Assay
IC50
4.00±n/a nM
Citation
 Di Francesco, MEJones, PCarroll, CLCross, JBRamaswamy, SKJohnson, MGLively, SLapointe, D Heterocyclic inhibitors of ATR kinase US Patent  US10800769 Publication Date 10/13/2020 
Target
Name:
ATR-interacting protein/Serine/threonine-protein kinase ATR
Synonyms:
ATR/ATRIP
Type:
Enzyme
Mol. Mass.:
Description:
Components:
This complex has 2 components.
Component 1
Name:
Serine/threonine-protein kinase ATR
Synonyms:
ATR Ataxia telangiectasia and Rad3-related protein (ATR) FRP1 | Serine-protein kinase ATR
Type:
Protein
Mol. Mass.:
301404.58
Organism:
Homo sapiens (Human)
Description:
Q13535
Residue:
2644
  
Component 2
Name:
ATR-interacting protein
Synonyms:
AGS1 ATR-interacting protein (ATRIP) ATRIP_HUMAN
Type:
Enzyme Catalytic Domain
Mol. Mass.:
85833.30
Organism:
Homo sapiens (Human)
Description:
Q8WXE1
Residue:
791
  
Inhibitor
Name:
BDBM411445
Synonyms:
US10392376, Example 17a US10800769, Example 17b | US11434233, Example 17a
Type:
Small organic molecule
Emp. Form.:
C19H24N6O2S
Mol. Mass.:
400.498
SMILES:
CC[S@](C)(=O)=Nc1cc(nc(n1)-c1ccnc2[nH]ccc12)N1CCOC[C@H]1C
: