Target
Serine/threonine-protein kinase Chk1
Ligand
BDBM466904
Substrate
Meas. Tech.
pCHK1 Cellular Assay
IC50
435±n/a nM
Citation
 Di Francesco, MEJones, PCarroll, CLCross, JBKang, ZJohnson, MGLively, S Heterocyclic inhibitors of ATR kinase US Patent  US10800774 Publication Date 10/13/2020 
Target
Name:
Serine/threonine-protein kinase Chk1
Synonyms:
CHEK1 CHK1 checkpoint homolog Checkpoint kinase-1 (CHK1)
Type:
Enzyme Catalytic Domain
Mol. Mass.:
54443.02
Organism:
Homo sapiens (Human)
Description:
gi_166295192
Residue:
476
  
Inhibitor
Name:
BDBM466904
Synonyms:
US10800774, Example 5b
Type:
Small organic molecule
Emp. Form.:
C20H22ClN5O3S
Mol. Mass.:
447.938
SMILES:
C[C@@H]1COCCN1c1cc(nc(n1)-c1cc(Cl)nc2[nH]ccc12)[C@@H]1CCCS1(=O)=O
: