Target
Serine/threonine-protein kinase Chk1
Ligand
BDBM466914
Substrate
Meas. Tech.
pCHK1 Cellular Assay
IC50
186±n/a nM
Citation
 Di Francesco, MEJones, PCarroll, CLCross, JBKang, ZJohnson, MGLively, S Heterocyclic inhibitors of ATR kinase US Patent  US10800774 Publication Date 10/13/2020 
Target
Name:
Serine/threonine-protein kinase Chk1
Synonyms:
CHEK1 CHK1 checkpoint homolog Checkpoint kinase-1 (CHK1)
Type:
Enzyme Catalytic Domain
Mol. Mass.:
54443.02
Organism:
Homo sapiens (Human)
Description:
gi_166295192
Residue:
476
  
Inhibitor
Name:
BDBM466914
Synonyms:
Methyl 4-{6-[(3R)-3- methylmorpholin-4-yl]-2- {1H-pyrrolo[2,3-b]pyridin-4- yl}pyrimidin-4-yl}piperidine- 1-carboxylate | US10800774, Example 13
Type:
Small organic molecule
Emp. Form.:
C23H28N6O3
Mol. Mass.:
436.5068
SMILES:
COC(=O)N1CCC(CC1)c1cc(nc(n1)-c1ccnc2[nH]ccc12)N1CCOC[C@H]1C
: